BDBM64147 3-benzyl-N-[2-(ethylamino)-2-keto-ethyl]-4-keto-phthalazine-1-carboxamide::3-benzyl-N-[2-(ethylamino)-2-oxoethyl]-4-oxophthalazine-1-carboxamide::MLS001175787::N-[2-(ethylamino)-2-oxidanylidene-ethyl]-4-oxidanylidene-3-(phenylmethyl)phthalazine-1-carboxamide::N-[2-(ethylamino)-2-oxoethyl]-4-oxo-3-(phenylmethyl)-1-phthalazinecarboxamide::SMR000594762::cid_9116295
SMILES CCNC(=O)CNC(=O)c1nn(Cc2ccccc2)c(=O)c2ccccc12
InChI Key InChIKey=GCHUEWOJXYAULR-UHFFFAOYSA-N
Data  1 EC50
  Tab Delimited (TSV)   2D SDfile   Computed 3D by Vconf -m prep SDfile
Find this compound or compounds like it in BindingDB:
Activity Spreadsheet -- Enzyme Inhibition Constant Data from BindingDB
Found 1 hit for monomerid = 64147
TargetHeat shock factor protein 1(Mus musculus)
Broad Institute
Curated by PubChem BioAssay
LigandPNGBDBM64147(3-benzyl-N-[2-(ethylamino)-2-keto-ethyl]-4-keto-ph...)
Affinity DataEC50: >1.95E+5nM. Assay description: Keywords: Heat Shock Factor-1 (HSF-1), Stress Response, MG132, NIH3T3, Luminescence Assay Overview: Modified NIH3T3, transformed to express firefly...
In DepthDetails PCBioAssay